{"text_format":"1","workbook":"xlsx","n_sheets":16,"sheets":["本ツールについて","A 最初に入力してください　基本情報","B 仕様入力シート　１２３４地域","窓のプルダウン_非表示","B 仕様入力シート　５６７地域","B 仕様入力シート　８地域","非表示_出力帳票へのリンク","C 仕様表（仕様基準）","プルダウン項目_非表示","ドアのプルダウン_非表示","断熱材_非表示","仕様基準-省エネ基準_非表示","設備メモ_非表示","登録値_断熱材λ値","登録値_窓、ドアのU値､ηd値","改定後_地域区分_非表示"],"not_rendered":{"charts":0,"images":17,"macros":1,"external_links":2,"defined_names":122,"comments":0,"pivot_tables":0},"unopened":[],"bounds":{"document_bytes":16777216,"sheet_cells":100000,"rows_first":2000,"rows_last":500,"rows_between":2000,"halvings":0,"cell_chars":16384,"cell_head_chars":4096},"cells_cut":0,"cells_raw":0,"read":"whole","date_system":"1900"}

{"sheet":"本ツールについて","index":0,"n_rows":31,"n_cols":26,"rows_kept":31,"cut":false,"hidden":false,"merged":[[0,25,0,27],[8,0,8,7]]}
["仕様基準に基づく仕様表作成ツール　【木造戸建て住宅用】",null,null,null,null,null,null,null,null,null,null,null,null,null,null,null,null,null,null,null,null,null,null,null,null,"Ver. 1.0"]
[]
[" ◇　本ツールは、住宅の省エネルギー基準の仕様基準に基づき、　「断熱構造とする部位＊1の断熱仕様・性能値」　、及び　「設備機器の仕様」　を入力したのち、一つの仕様表として出力(印刷)します。"]
["　　　*1：断熱構造とする部位とは、外気と室内を熱的に区分し、断熱及び日射遮蔽の措置を講じた構造を断熱構造といい、屋根、天井、壁、床、開口部などの部位を指します（右図参照）。"]
[" ◇　木造戸建て住宅を対象としています。S造戸建て住宅、RC造戸建て住宅は対象外です。"]
[" ◇　シート　「C 仕様表 （仕様基準）」　は、設計図書の一部として確認検査機関等への申請時に使用することができます。"]
{"$rows_left_out":26}
{"sheet":"A 最初に入力してください　基本情報","index":1,"n_rows":22,"n_cols":35,"rows_kept":22,"cut":false,"hidden":false,"merged":[[4,2,4,4],[20,4,21,16],[8,2,8,16],[6,2,6,16],[20,0,21,1],[20,2,21,2],[15,2,15,3],[18,2,18,16],[12,2,12,16],[10,2,10,16]]}
["基 本 情 報"]
[]
[]
[null,null,"申請する建築士名：",null,null,null,"記入日（西暦）："]
[null,null,null,null,null,null,null,"年",null,"月",null,"日"]
[]
{"$rows_left_out":17}
{"sheet":"B 仕様入力シート　１２３４地域","index":2,"n_rows":83,"n_cols":53,"rows_kept":83,"cut":false,"hidden":false,"merged":[[60,3,60,13],[68,3,68,13],[73,3,73,13],[79,3,79,13],[80,1,82,1],[82,3,82,13],[36,10,36,13],[37,3,37,4],[37,5,37,6],[37,7,37,8],[37,10,37,13],[34,3,34,4],[34,5,34,6],[34,7,34,8],[34,10,34,13],[34,14,34,15],[28,10,28,13],[25,10,25,13],[33,3,33,4],[33,5,33,6],[33,7,33,8],[33,10,33,13],[32,3,32,4],[32,5,32,6],[32,7,32,8],[32,10,32,13],[28,3,28,4],[28,5,28,6],[28,7,28,8],[24,3,24,4],[24,5,24,6],[24,7,24,8],[25,3,25,4],[25,5,25,6],[25,7,25,8],[17,5,17,6],[17,11,17,14],[18,5,18,6],[18,11,18,14],[23,6,23,7],[23,8,23,9],[23,10,23,11],[14,5,14,6],[14,11,14,14],[15,5,15,6],[15,11,15,14],[16,5,16,6],[16,11,16,14],[35,10,35,13],[0,1,2,6],[9,1,10,1],[9,4,10,4],[9,5,10,6],[9,7,10,7],[0,7,2,7],[13,5,13,6],[13,11,13,14],[7,5,7,6],[8,5,8,6],[8,11,8,14],[9,11,9,14],[10,11,10,14],[12,5,12,6],[12,11,12,14],[25,14,25,15],[26,10,26,13],[27,10,27,13],[9,17,10,17],[0,8,2,8],[0,10,2,13],[0,14,0,15],[1,9,2,9],[1,14,2,15],[9,8,10,8],[11,11,11,14],[8,15,9,16],[24,10,24,13]]}
[null,"１ ・ ２ ・ ３ ・ ４ 地域　仕様入力シート",null,null,null,null,null,"地域の区分",{"$f":"IF('A 最初に入力してください　基本情報'!C21=\"\",\"\",'A 最初に入力してください　基本情報'!C21)","v":""},null,{"$f":"IF(OR('A 最初に入力してください　基本情報'!C16=\"\",'A 最初に入力してください　基本情報'!C19=\"\"),\"\",IF(OR(I1=1,I1=2,I1=3,I1=4),\"\",\"←入力するシートが違います!!\"))","v":""},null,null,null,"省エネ基準適否",null,null,null,null,null,null,null,null,null,null,"非表示","非表示","非表示","非表示","非表示","非表示","非表示","非表示","非表示","非表示","非表示","非表示","非表示","非表示","非表示","非表示","非表示","非表示","非表示","非表示","非表示","非表示","非表示","非表示","非表示","非表示","非表示","非表示"]
[null,null,null,null,null,null,null,null,null,"地域",null,null,null,null,{"$f":"IF(OR(I1=1,I1=2,I1=3,I1=4),IF((SUM(AP13:AP19)+SUM(AP29:AP29)+AP38+AP42)>0,\"不適\",\"適合\"),\"\")","v":""}]
[]
[]
[]
[]
{"$rows_left_out":78}
{"sheet":"窓のプルダウン_非表示","index":3,"n_rows":62,"n_cols":58,"rows_kept":62,"cut":false,"hidden":true,"merged":[[60,32,60,34],[60,36,60,37],[60,38,60,39],[61,25,61,42],[53,26,60,27],[53,28,59,29],[53,30,57,30],[53,31,54,31],[55,31,57,31],[58,30,59,30],[58,31,59,31],[60,28,60,29],[58,32,58,34],[58,36,58,37],[58,38,58,39],[59,32,59,34],[59,36,59,37],[59,38,59,39],[56,32,56,34],[56,36,56,37],[56,38,56,39],[57,32,57,34],[57,36,57,37],[57,38,57,39],[44,31,45,31],[46,28,51,29],[46,30,49,30],[46,31,47,31],[48,31,49,31],[50,30,51,30],[50,31,51,31],[30,28,30,29],[31,26,52,27],[31,28,45,29],[31,30,37,30],[31,31,33,31],[34,31,37,31],[38,30,43,30],[38,31,40,31],[41,31,43,31],[44,30,45,30],[52,28,52,29],[22,28,29,29],[22,30,27,30],[22,31,24,31],[25,31,27,31],[28,30,29,30],[28,31,29,31],[6,26,30,27],[6,28,21,29],[6,30,13,30],[6,31,9,31],[10,31,13,31],[14,30,19,30],[14,31,15,31],[16,31,19,31],[20,30,21,30],[20,31,21,31],[55,32,55,34],[55,36,55,37],[55,38,55,39],[50,36,50,37],[50,38,50,39],[51,32,51,34],[51,36,51,37],[51,38,51,39],[48,36,48,37],[48,38,48,39],[49,32,49,34],[49,36,49,37],[49,38,49,39],[50,32,50,34],[53,32,53,34],[53,36,53,37],[53,38,53,39],[54,32,54,34],[54,36,54,37],[54,38,54,39],[52,32,52,34],[52,36,52,37],[52,38,52,39],[46,32,46,34],[46,36,46,37],[46,38,46,39],[47,32,47,34],[47,36,47,37],[47,38,47,39],[48,32,48,34],[44,36,44,37],[44,38,44,39],[45,32,45,34],[45,36,45,37],[45,38,45,39],[42,36,42,37],[42,38,42,39],[43,32,43,34],[43,36,43,37],[43,38,43,39],[44,32,44,34],[40,32,40,34],[40,36,40,37],[40,38,40,39],[41,32,41,34],[41,36,41,37],[41,38,41,39],[42,32,42,34],[38,32,38,34],[38,36,38,37],[38,38,38,39],[39,32,39,34],[39,36,39,37],[39,38,39,39],[36,32,36,34],[36,36,36,37],[36,38,36,39],[37,32,37,34],[37,36,37,37],[37,38,37,39],[34,36,34,37],[34,38,34,39],[35,32,35,34],[35,36,35,37],[35,38,35,39],[32,32,32,34],[32,36,32,37],[32,38,32,39],[33,32,33,34],[33,36,33,37],[33,38,33,39],[34,32,34,34],[30,36,30,37],[30,38,30,39],[31,32,31,34],[31,36,31,37],[31,38,31,39],[29,32,29,34],[29,36,29,37],[29,38,29,39],[30,32,30,34],[27,32,27,34],[27,36,27,37],[27,38,27,39],[28,32,28,34],[28,36,28,37],[28,38,28,39],[25,32,25,34],[25,36,25,37],[25,38,25,39],[26,32,26,34],[26,36,26,37],[26,38,26,39],[24,32,24,34],[24,36,24,37],[24,38,24,39],[22,32,22,34],[22,36,22,37],[22,38,22,39],[23,32,23,34],[23,36,23,37],[23,38,23,39],[21,32,21,34],[21,36,21,37],[21,38,21,39],[19,32,19,34],[19,36,19,37],[19,38,19,39],[20,32,20,34],[20,36,20,37],[20,38,20,39],[17,36,17,37],[17,38,17,39],[18,32,18,34],[18,36,18,37],[18,38,18,39],[15,32,15,34],[15,36,15,37],[15,38,15,39],[16,32,16,34],[16,36,16,37],[16,38,16,39],[17,32,17,34],[10,36,10,37],[10,38,10,39],[8,32,8,34],[8,36,8,37],[8,38,8,39],[13,32,13,34],[13,36,13,37],[13,38,13,39],[14,32,14,34],[14,36,14,37],[14,38,14,39],[11,36,11,37],[11,38,11,39],[12,32,12,34],[12,36,12,37],[12,38,12,39],[11,32,11,34],[23,51,23,53],[24,51,24,53],[25,51,25,53],[26,51,26,53],[27,51,27,53],[4,28,5,30],[4,26,5,27],[6,32,6,34],[6,36,6,37],[6,38,6,39],[4,31,4,34],[4,45,5,46],[4,47,5,49],[4,41,4,43],[7,32,7,34],[7,36,7,37],[7,38,7,39],[5,32,5,34],[5,36,5,37],[5,38,5,39],[9,32,9,34],[9,36,9,37],[9,38,9,39],[10,32,10,34],[13,51,13,53],[14,51,14,53],[15,51,15,53],[17,51,17,53],[18,51,18,53],[19,51,19,53],[20,51,20,53],[21,51,21,53],[22,51,22,53],[4,50,4,53],[5,51,5,53],[6,51,6,53],[7,51,7,53],[8,51,8,53],[9,51,9,53],[10,51,10,53],[11,51,11,53],[12,51,12,53],[28,51,28,53],[29,51,29,53],[45,51,45,53],[46,51,46,53],[47,51,47,53],[48,51,48,53],[49,51,49,53],[50,51,50,53],[51,51,51,53],[30,51,30,53],[52,51,52,53],[31,51,31,53],[32,51,32,53],[33,51,33,53],[34,51,34,53],[35,51,35,53],[36,51,36,53],[37,51,37,53],[38,51,38,53],[39,51,39,53],[40,51,40,53],[41,51,41,53],[42,51,42,53],[43,51,43,53],[44,51,44,53],[53,51,53,53],[54,51,54,53],[55,51,55,53],[56,51,56,53],[57,51,57,53],[58,51,58,53],[59,51,59,53],[60,51,60,53],[61,51,61,53],[24,54,24,56],[26,54,26,56],[6,54,6,56],[7,54,7,56],[8,54,8,56],[10,54,10,56],[11,54,11,56],[12,54,12,56],[13,54,13,56],[14,54,14,56],[15,54,15,56],[27,54,27,56],[29,54,29,56],[30,54,30,56],[31,54,31,56],[20,54,20,56],[9,54,9,56],[25,54,25,56],[28,54,28,56],[23,57,23,59],[24,57,24,59],[26,57,26,59],[27,57,27,59],[29,57,29,59],[30,57,30,59],[31,57,31,59],[28,57,28,59],[25,57,25,59],[16,54,16,56],[17,54,17,56],[18,54,18,56],[19,54,19,56],[21,54,21,56],[22,54,22,56],[23,54,23,56]]}
[null,null,"名前の定義の注意点",null,null,null,null,null,null,null,null,null,null,null,null,null,null,null,null,null,null,null,null,null,null,null,null,null,null,null,null,null,null,null,null,null,null,null,null,null,null,null,null,null,null,"確認"]
[null,null,"・先頭は数字NG"]
[null,null,"・-、()の仕様はNG"]
[null,null,null,null,null,null,null,null,null,null,null,null,null,null,null,null,null,"ガイドブックより小数点第２位を四捨五入した値を表示(24/12/18)",null,null,null,null,null,null,null,null,null,null,null,null,null,null,null,null,null,null,null,null,null,null,null,null,null,null,null,null,null,null,null,null,null,"樹脂製建具 又は木製建具",null,null,"樹脂（又は木）と金属の複合材料製建具",null,null,"その他\n・金属製建具\n・金属製熱遮断構造建具等"]
[null,"【名前の管理】",null,null,null,null,null,null,null,null,null,null,null,null,null,null,null,"開口部の熱貫流率",null,null,null,null,null,null,null,null,"建具の仕様",null,"ガラスの仕様",null,null,"中空層の仕様",null,null,null,"開口部の熱貫流率\n [W/(㎡・K)] ※2 ",null,null,null,null,null,"日射熱取得率ηｇ",null,null,null,"建具の仕様",null,"ガラスの仕様",null,null,"中空層の仕様"]
[null,"名前","建具の仕様",null,null,"樹脂製建具又は木製建具",null,"樹脂製建具又は木製建具_三層複層ガラス_Low_E２枚",null,"樹脂_又は木_と金属の複合材料製建具_三層複層ガラス_Low_E２枚",null,null,null,"三層複層ガラス_Low_E２枚",null,null,null,"付属部材無し","日射取得型","日射遮蔽型","ー",null,null,null,null,null,null,null,null,null,null,"ガスの封入※1 ","中空層の厚さ",null,null,"付属部材無し","シャッター・\n雨戸付",null,"紙障子付",null,"風除室あり","日射取得型","日射遮蔽型","ー",null,null,null,null,null,null,"ガスの封入※1 ","中空層の厚さ"]
{"$rows_left_out":57}
{"sheet":"B 仕様入力シート　５６７地域","index":4,"n_rows":85,"n_cols":53,"rows_kept":85,"cut":false,"hidden":false,"merged":[[81,3,81,13],[38,10,38,13],[28,1,30,1],[13,5,13,6],[82,1,84,1],[42,3,42,4],[39,7,39,8],[42,7,42,8],[37,7,37,8],[38,5,38,6],[38,7,38,8],[37,5,37,6],[42,5,42,6],[84,3,84,13],[39,3,39,4],[38,3,38,4],[71,3,71,13],[76,3,76,13],[9,5,10,6],[25,2,25,3],[29,2,30,2],[30,6,30,7],[17,5,17,6],[15,5,15,6],[9,7,10,7],[28,6,28,7],[29,6,29,7],[63,3,63,13],[37,3,37,4],[29,8,29,9],[39,5,39,6],[30,8,30,9],[25,21,25,22],[25,10,25,11],[15,11,15,14],[23,8,23,9],[28,2,28,3],[23,6,23,7],[18,5,18,6],[28,8,28,9],[24,8,24,9],[25,8,25,9],[25,19,25,20],[24,15,24,18],[25,15,25,18],[27,15,27,18],[28,15,28,18],[26,15,26,18],[11,11,11,14],[12,11,12,14],[13,11,13,14],[14,11,14,14],[0,8,2,8],[14,5,14,6],[12,5,12,6],[37,10,37,13],[24,6,24,7],[25,6,25,7],[16,5,16,6],[24,10,24,11],[30,10,30,11],[0,7,2,7],[1,9,2,9],[0,10,2,13],[0,1,2,6],[9,17,10,17],[9,11,9,14],[10,11,10,14],[8,15,9,16],[0,14,0,15],[1,14,2,15],[8,5,8,6],[9,8,10,8],[7,5,7,6],[8,11,8,14],[9,1,10,1],[9,4,10,4],[42,10,42,13],[25,12,26,12],[16,11,16,14],[17,11,17,14],[18,11,18,14],[23,10,23,11],[25,14,26,14],[39,14,39,15],[40,10,40,13],[29,10,29,11],[29,15,29,18],[28,10,28,11],[39,10,39,13],[41,10,41,13],[23,15,23,18],[30,15,30,18]]}
[null,"５ ・ ６ ・ ７ 地域　仕様入力シート",null,null,null,null,null,"地域の区分",{"$f":"IF('A 最初に入力してください　基本情報'!C21=\"\",\"\",'A 最初に入力してください　基本情報'!C21)","v":""},null,{"$f":"IF(OR('A 最初に入力してください　基本情報'!C16=\"\",'A 最初に入力してください　基本情報'!C19=\"\"),\"\",IF(OR(I1=5,I1=6,I1=7),\"\",\"←入力するシートが違います!!\"))","v":""},null,null,null,"省エネ基準適否",null,null,null,null,null,null,null,null,null,null,"非表示","非表示","非表示","非表示","非表示","非表示","非表示","非表示","非表示","非表示","非表示","非表示","非表示","非表示","非表示","非表示","非表示","非表示","非表示","非表示","非表示","非表示","非表示","非表示","非表示","非表示","非表示","非表示"]
[null,null,null,null,null,null,null,null,null,"地域",null,null,null,null,{"$f":"IF(OR(I1=5,I1=6,I1=7),IF((SUM(AP13:AP19)+SUM(AP29:AP31)+AP43+AP47)>0,\"不適\",\"適合\"),\"\")","v":""}]
[]
[]
[]
[]
{"$rows_left_out":80}
{"sheet":"B 仕様入力シート　８地域","index":5,"n_rows":52,"n_cols":53,"rows_kept":52,"cut":false,"hidden":false,"merged":[[0,1,2,6],[0,7,2,7],[0,8,2,8],[0,10,2,13],[0,14,0,15],[1,9,2,9],[1,14,2,15],[9,1,10,1],[9,4,10,4],[9,5,10,6],[9,7,10,7],[9,8,10,8],[8,15,9,16],[9,17,10,17],[11,11,11,14],[12,5,12,6],[12,11,12,14],[7,5,7,6],[8,5,8,6],[8,11,8,14],[9,11,9,14],[10,11,10,14],[13,5,13,6],[13,11,13,14],[16,6,16,7],[16,8,16,9],[16,10,16,11],[18,2,18,3],[18,6,18,7],[18,8,18,9],[18,10,18,11],[17,14,17,17],[18,12,19,12],[18,14,18,17],[17,6,17,7],[17,8,17,9],[17,10,17,11],[18,18,18,19],[19,14,19,17],[20,14,20,17],[18,13,19,13],[21,14,21,17],[22,14,22,17],[49,1,51,1],[38,3,38,13],[43,3,43,13],[48,3,48,13],[51,3,51,13],[21,1,22,1],[22,6,22,7],[22,8,22,9],[22,10,22,11],[21,2,21,3],[21,6,21,7],[21,8,21,9],[21,10,21,11]]}
[null,"８ 地域　仕様入力シート",null,null,null,null,null,"地域の区分",{"$f":"IF('A 最初に入力してください　基本情報'!C21=\"\",\"\",'A 最初に入力してください　基本情報'!C21)","v":""},null,{"$f":"IF(OR('A 最初に入力してください　基本情報'!C16=\"\",'A 最初に入力してください　基本情報'!C19=\"\"),\"\",IF(I1=8,\"\",\"←入力するシートが違います!!\"))","v":""},null,null,null,"省エネ基準適否",null,null,null,null,null,null,null,null,null,null,"非表示","非表示","非表示","非表示","非表示","非表示","非表示","非表示","非表示","非表示","非表示","非表示","非表示","非表示","非表示","非表示","非表示","非表示","非表示","非表示","非表示","非表示","非表示","非表示","非表示","非表示","非表示","非表示"]
[null,null,null,null,null,null,null,null,null,"地域",null,null,null,null,{"$f":"IF(I1=8,IF((SUM(AP13:AP14)+SUM(AP22:AP23)+AP32)>0,\"不適\",\"適合\"),\"\")","v":""}]
[]
[]
[]
[]
{"$rows_left_out":47}
{"sheet":"非表示_出力帳票へのリンク","index":6,"n_rows":100,"n_cols":19,"rows_kept":100,"cut":false,"hidden":true,"merged":[[82,1,87,1],[88,1,99,1],[88,2,90,2],[91,2,93,2],[94,2,95,2],[96,2,97,2],[98,2,99,2],[22,2,27,2],[28,2,33,2],[34,2,39,2],[73,2,81,2],[10,1,49,1],[50,1,81,1],[40,2,44,2],[45,2,49,2],[50,2,56,2],[57,2,63,2],[64,2,72,2],[10,2,15,2],[16,2,21,2]]}
["No","出力帳票項目名",null,null,"共通","1234地域","567地域","8地域",1,2,3,4,5,6,7,8]
[1,"作成者",null,null,{"$f":"IF('A 最初に入力してください　基本情報'!C5=\"\",\"\",'A 最初に入力してください　基本情報'!C5)","v":""},null,null,null,{"$f":"$E2","v":""},{"$f":"$E2","v":""},"","","","","",{"$f":"$E2","v":""}]
[2,"記入日",null,null,{"$f":"IF(OR('A 最初に入力してください　基本情報'!G5=\"\",'A 最初に入力してください　基本情報'!I5=\"\",'A 最初に入力してください　基本情報'!K5=\"\"),\"\",'A 最初に入力してください　基本情報'!G5&\"年 \"&'A 最初に入力してください　基本情報'!I5&\"月 \"&'A 最初に入力してください　基本情報'!K5&\"日\")","v":""},null,null,null,{"$f":"$E3","v":""},"","","","","","",{"$f":"$E3","v":""}]
[3,"会社名",null,null,{"$f":"IF('A 最初に入力してください　基本情報'!C7=\"\",\"\",'A 最初に入力してください　基本情報'!C7)","v":""},null,null,null,"","","","","","","",""]
[4,"事務所登録",null,null,{"$f":"IF('A 最初に入力してください　基本情報'!C9=\"\",\"\",'A 最初に入力してください　基本情報'!C9)","v":""},null,null,null,"","","","","","","",""]
[5,"建築士番号",null,null,{"$f":"IF('A 最初に入力してください　基本情報'!C11=\"\",\"\",'A 最初に入力してください　基本情報'!C11)","v":""},null,null,null,"","","","","","","",""]
{"$rows_left_out":95}
{"sheet":"C 仕様表（仕様基準）","index":7,"n_rows":40,"n_cols":29,"rows_kept":40,"cut":false,"hidden":false,"merged":[[35,2,35,5],[35,6,35,7],[35,8,35,10],[35,19,35,24],[29,17,29,18],[29,19,30,24],[31,2,31,5],[38,2,38,5],[38,6,38,7],[31,6,31,7],[31,8,31,10],[31,11,31,16],[31,19,31,24],[29,2,30,5],[29,6,30,7],[29,8,30,10],[29,11,30,16],[34,2,34,5],[34,6,34,18],[34,19,34,24],[35,12,35,18],[39,2,39,5],[39,6,39,7],[39,19,39,24],[36,2,36,5],[36,6,36,7],[36,19,36,24],[37,2,37,5],[37,6,37,7],[37,8,37,18],[37,19,37,24],[38,19,38,24],[39,8,39,18],[38,8,38,18],[36,12,36,18],[36,8,36,10],[11,7,11,12],[12,2,12,5],[12,7,12,12],[12,16,12,24],[13,2,13,5],[13,7,13,12],[13,16,13,24],[10,2,11,5],[10,6,11,6],[10,7,10,13],[10,14,10,15],[10,16,11,24],[23,19,23,24],[24,3,26,3],[17,2,18,3],[17,4,17,5],[17,7,17,12],[17,16,17,24],[18,4,18,5],[18,7,18,12],[26,19,26,24],[21,17,21,18],[21,19,22,24],[23,2,26,2],[18,16,18,24],[24,19,24,24],[26,6,26,8],[26,9,26,10],[26,11,26,13],[25,19,25,24],[25,6,25,8],[25,9,25,10],[25,11,25,13],[25,4,26,4],[24,4,24,5],[21,2,22,5],[14,2,14,5],[14,7,14,12],[14,16,14,24],[15,2,16,3],[15,4,15,5],[15,7,15,12],[15,16,15,24],[16,4,16,5],[16,7,16,12],[16,16,16,24],[21,6,22,8],[21,9,22,10],[21,11,22,13],[21,14,22,14],[21,15,21,16],[24,6,24,8],[24,9,24,10],[24,11,24,13],[23,4,23,5],[23,6,23,8],[23,9,23,10],[23,11,23,13],[5,2,5,4],[6,2,6,4],[7,2,7,4],[5,17,5,24],[6,17,6,24],[7,12,7,24],[5,11,5,15],[6,11,6,15],[5,5,5,9],[6,5,6,9],[7,5,7,9]]}
[null,null,6,6,9.5,10,9,9,9,10,9,9,9,10,10,9,9,9,9,9,9,null,9,9,9]
[]
[30,null,"仕様表　木造戸建て住宅（仕様基準）",null,null,null,null,null,null,"建築物省エネ法第10条に基づく省エネ基準適合義務に関する事項",null,null,null,null,null,null,null,null,null,null,null,null,null,null,null,null,"拡大率57％"]
[6]
[30,null,"基本情報",null,null,null,null,null,null,null,null,null,null,null,null,null,null,null,null,null,null,null,null,null,null,null,"地域の区分",{"$f":"'A 最初に入力してください　基本情報'!C21","v":""},{"$f":"AB5+8","v":{"$error":"#VALUE!"}}]
[27,null,"申請する建築士名",null,null,{"$f":"IFERROR(VLOOKUP(1,非表示_出力帳票へのリンク!$A$2:$P$100,'C 仕様表（仕様基準）'!AC5,FALSE),\"\")","v":""},null,null,null,null,"記入日",{"$f":"IFERROR(VLOOKUP(2,非表示_出力帳票へのリンク!$A$2:$P$100,'C 仕様表（仕様基準）'!AC5,FALSE),\"\")","v":""},null,null,null,null,"会社名",{"$f":"IFERROR(VLOOKUP(3,非表示_出力帳票へのリンク!$A$2:$P$100,'C 仕様表（仕様基準）'!AC5,FALSE),\"\")","v":""}]
{"$rows_left_out":35}
{"sheet":"プルダウン項目_非表示","index":8,"n_rows":10,"n_cols":9,"rows_kept":10,"cut":false,"hidden":true,"merged":[]}
[null,null,null,"屋根"]
[null,null,null,"天井"]
[null,null,null,"壁"]
[null,null,null,"床\n外気に接する部分","床\nその他の部分"]
[null,null,null,null,null,"土間床等の外周部分の\n基礎壁\n（外気に接する部分）"]
[null,null,null,null,null,"土間床等の外周部分の\n基礎壁\n（その他の部分）"]
{"$rows_left_out":5}
{"sheet":"ドアのプルダウン_非表示","index":9,"n_rows":102,"n_cols":23,"rows_kept":102,"cut":false,"hidden":true,"merged":[[57,22,57,23],[1,12,1,15],[1,16,1,17],[12,11,13,11],[55,22,55,23],[56,16,56,17],[56,20,56,21],[56,22,56,23],[57,12,57,13],[57,14,57,15],[57,16,57,17],[57,20,57,21],[55,11,56,11],[55,12,56,13],[55,14,56,15],[55,16,55,17],[55,20,55,21],[54,12,54,13],[54,14,54,15],[54,16,54,17],[54,20,54,21],[54,22,54,23],[53,12,53,13],[53,14,53,15],[50,20,50,21],[51,20,51,21],[49,11,50,11],[49,14,49,15],[49,12,51,12],[53,16,53,17],[53,20,53,21],[53,22,53,23],[52,12,52,13],[52,14,52,15],[52,16,52,17],[52,20,52,21],[52,22,52,23],[49,22,49,23],[51,22,51,23],[50,22,50,23],[49,16,49,17],[49,20,49,21],[48,22,48,23],[46,22,46,23],[47,12,47,13],[47,14,47,15],[47,16,47,17],[47,20,47,21],[47,22,47,23],[43,22,43,23],[44,14,46,15],[44,16,45,17],[44,20,44,21],[44,22,44,23],[45,20,45,21],[45,22,45,23],[46,16,46,17],[48,12,48,13],[48,14,48,15],[48,16,48,17],[48,20,48,21],[43,11,46,11],[43,12,46,13],[43,14,43,15],[43,16,43,17],[43,20,43,21],[46,20,46,21],[42,12,42,13],[42,14,42,15],[42,16,42,17],[42,20,42,21],[42,22,42,23],[41,12,41,13],[41,14,41,15],[41,16,41,17],[41,20,41,21],[41,22,41,23],[40,12,40,13],[40,14,40,15],[40,16,40,17],[40,20,40,21],[40,22,40,23],[39,12,39,13],[39,14,39,15],[39,16,39,17],[39,20,39,21],[39,22,39,23],[35,22,35,23],[36,14,38,15],[36,16,37,17],[36,20,36,21],[36,22,36,23],[37,20,37,21],[37,22,37,23],[38,16,38,17],[35,11,38,11],[35,12,38,13],[35,14,35,15],[35,16,35,17],[35,20,35,21],[38,20,38,21],[33,20,33,21],[33,22,33,23],[34,12,34,13],[34,14,34,15],[34,16,34,17],[34,20,34,21],[34,22,34,23],[38,22,38,23],[30,20,30,21],[30,22,30,23],[31,20,31,21],[31,22,31,23],[32,18,33,18],[32,20,32,21],[32,22,32,23],[30,11,33,11],[30,12,33,13],[30,14,33,15],[30,16,33,17],[30,18,31,18],[29,12,29,13],[29,14,29,15],[29,16,29,17],[29,20,29,21],[29,22,29,23],[28,12,28,13],[28,14,28,15],[28,16,28,17],[28,20,28,21],[28,22,28,23],[26,22,26,23],[27,12,27,13],[27,14,27,15],[27,16,27,17],[27,20,27,21],[27,22,27,23],[26,12,26,13],[26,14,26,15],[26,16,26,17],[26,18,27,18],[26,20,26,21],[24,22,24,23],[25,12,25,13],[25,14,25,15],[25,16,25,17],[25,20,25,21],[25,22,25,23],[24,12,24,13],[24,14,24,15],[24,16,24,17],[24,18,25,18],[24,20,24,21],[23,12,23,13],[23,14,23,15],[23,16,23,17],[23,20,23,21],[23,22,23,23],[22,12,22,13],[22,14,22,15],[22,16,22,17],[22,20,22,21],[22,22,22,23],[21,12,21,13],[21,14,21,15],[21,16,21,17],[21,20,21,21],[21,22,21,23],[20,12,20,13],[20,14,20,15],[20,16,20,17],[20,20,20,21],[20,22,20,23],[19,12,19,13],[19,14,19,15],[19,16,19,17],[19,20,19,21],[19,22,19,23],[15,22,15,23],[16,14,18,15],[16,16,17,17],[16,20,16,21],[16,22,16,23],[17,20,17,21],[17,22,17,23],[18,16,18,17],[15,11,18,11],[15,12,18,13],[15,14,15,15],[15,16,15,17],[15,20,15,21],[18,20,18,21],[13,22,13,23],[14,14,14,15],[14,16,14,17],[14,20,14,21],[14,22,14,23],[9,12,14,13],[9,14,9,15],[9,16,9,17],[9,20,9,21],[9,22,9,23],[18,22,18,23],[12,14,12,15],[12,16,12,17],[12,18,13,18],[12,20,12,21],[12,22,12,23],[13,14,13,15],[13,16,13,17],[13,20,13,21],[10,20,10,21],[10,22,10,23],[11,14,11,15],[11,16,11,17],[11,20,11,21],[11,22,11,23],[10,14,10,15],[10,16,10,17],[10,18,11,18],[8,12,8,13],[8,14,8,15],[8,16,8,17],[8,20,8,21],[8,22,8,23],[6,22,6,23],[7,12,7,13],[7,14,7,15],[7,16,7,17],[7,20,7,21],[7,22,7,23],[6,12,6,13],[6,14,6,15],[6,16,6,17],[6,18,7,18],[6,20,6,21],[4,22,4,23],[5,12,5,13],[5,14,5,15],[5,16,5,17],[5,20,5,21],[5,22,5,23],[4,12,4,13],[4,14,4,15],[4,16,4,17],[4,18,5,18],[4,20,4,21],[3,12,3,13],[3,14,3,15],[3,16,3,17],[3,20,3,21],[3,22,3,23],[1,11,2,11],[1,20,1,23],[2,20,2,21],[2,22,2,23]]}
[null,"枠の仕様",null,null,"戸の仕様",null,"ガラスの仕様_中空層の仕様"]
[null,null,null,null,null,null,null,null,null,null,null,"枠の仕様","戸の仕様",null,null,null,"ガラスの仕様",null,"中空層","の仕様","開口部の熱貫流率［W/(㎡・K)] ※2 "]
[null,"建具の仕様",null,null,"金属製熱遮断構造",null,"金属製熱遮断構造_金属製高断熱フラッシュ構造_ドア内ガラスなし",null,null,"ドアの熱貫流率",null,null,null,null,null,null,null,null,"ガスの封入※1 ","中空層の厚さ","付属部材無し",null,"風除室あり"]
[null,"金属製熱遮断構造",null,null,"金属製高断熱フラッシュ構造_ドア内ガラスなし",null,"－",null,{"$f":"G$3&\"_\"&G4","v":"金属製熱遮断構造_金属製高断熱フラッシュ構造_ドア内ガラスなし_－"},{"$f":"ROUND(U4,1)","v":1.6},null,null,null,null,"ドア内ガラスなし",null,"－",null,"－","－",1.6,null,1.38]
[null,"複合材料製",null,null,"金属製高断熱フラッシュ構造_ドア内ガラスあり",null,null,null,{"$f":"G$6&\"_\"&G7","v":"金属製熱遮断構造_金属製高断熱フラッシュ構造_ドア内ガラスあり_Low-E二層複層ガラス_ガスの封入されている_7 ㎜以上"},{"$f":"ROUND(U5,1)","v":1.9},null,null,"金属製",null,null,null,null,null,"されている","7 ㎜以上",1.9,null,1.6]
[null,"金属製又はその他",null,null,"金属製断熱フラッシュ構造_ドア内ガラスなし",null,"金属製熱遮断構造_金属製高断熱フラッシュ構造_ドア内ガラスあり",null,{"$f":"G$6&\"_\"&G8","v":"金属製熱遮断構造_金属製高断熱フラッシュ構造_ドア内ガラスあり_Low-E二層複層ガラス_ガスの封入されている_7 ㎜未満"},2.2999999999999998,null,null,"高断熱",null,null,null,"Low-E",null,null,"7 ㎜未満",2.33,null,1.89]
{"$rows_left_out":97}
{"sheet":"断熱材_非表示","index":10,"n_rows":87,"n_cols":15,"rows_kept":87,"cut":false,"hidden":true,"merged":[[79,1,80,4],[81,1,86,4],[67,1,71,1],[67,2,71,2],[72,1,78,4],[47,2,52,2],[53,2,56,2],[57,2,58,2],[61,2,66,2],[36,3,37,3],[39,3,41,3],[42,3,45,3],[48,3,52,3],[53,3,54,3],[55,3,56,3],[61,3,63,3],[64,3,66,3],[36,2,37,2],[39,2,45,2],[46,1,56,1],[57,1,60,1],[61,1,66,1],[30,1,31,1],[32,1,35,1],[36,1,45,1],[3,1,3,4],[24,1,29,1],[5,1,23,1],[5,2,8,3],[9,2,23,3]]}
[null,"住宅の省エネルギー基準と評価方法2024【戸建住宅版】　 6-029　6-030　6-031"]
[]
[]
[null,"種類",null,null,null,"製品記号","断熱材の種類（製品記号）","熱伝導率λ                      ","備考"," JIS",null,null,null,null,"断熱材の種類（製品記号）"]
[null,null,null,null,null,null,null,"［W（/ m・K）］"]
[null,"グラスウール断熱材","通常品",null,"10-50","GW10-50",{"$f":"N6","v":"グラスウール断熱材 通常品10-50"},0.05,null," JIS A 9521_2022   建築用断熱材（抜粋）",null,{"$f":"B6","v":"グラスウール断熱材"},{"$f":"C$6&E6","v":"通常品10-50"},{"$f":"L6&\" \"&M6","v":"グラスウール断熱材 通常品10-50"},"グラスウール断熱材 GW10-50"]
{"$rows_left_out":82}
{"sheet":"仕様基準-省エネ基準_非表示","index":11,"n_rows":37,"n_cols":18,"rows_kept":37,"cut":false,"hidden":true,"merged":[[3,12,3,13],[3,11,4,11],[3,16,4,16]]}
[null,null,2,3,4,5,6,7,8,9]
[null,"仕様基準【省エネ基準】　断熱材の熱抵抗値基準　",null,null,null,null,"以上であること",null,null,null,null,"仕様基準　",null,null,"以下であること",null,"仕様基準　"]
[null,"木造（軸組充填）",null,null,null,null,null,null,"木造（内断熱）",null,null,"窓の熱貫流率U　η",null,null,null,null,"ドアの熱貫流率U　η"]
[null,"部位","屋根","天井","外壁","床","床",null,"基礎","基礎",null,"地域区分","U",null,"η",null,"地域区分","U"]
[null,"地域区分","充填","充填","充填","外気床","その他床",null,"外気接","その他",null,null,"誘導基準","省エネ基準","省エネ基準",null,null,"省エネ基準"]
[null,1,6.6,5.7,3.3,5.2,3.3,null,3.5,1.2,null,1,1.9,2.2999999999999998,null,null,1,2.2999999999999998]
{"$rows_left_out":32}
{"sheet":"設備メモ_非表示","index":12,"n_rows":85,"n_cols":15,"rows_kept":85,"cut":false,"hidden":true,"merged":[[40,1,42,1],[42,3,42,13],[64,3,64,13],[72,3,72,13],[84,3,84,13],[20,3,20,13],[28,3,28,13],[33,3,33,13],[39,3,39,13]]}
["１２３４地域"]
[null,null,null,"住戸全体を暖房　　",null,"ダクト式セントラル空調機で、ヒートポンプを熱源とするもの",null,null,null,null,null,null,null,null,"off：2，3，4，5，7，8，9，24，28，29，30，31，32，33，34，35"]
[null,null,null,"居室のみを暖房",null,null,null,null,null,null,null,null,null,null,"off：1，3"]
[null,null,null,null,"【主たる居室】",null,"パネルラジエーターで以下のいずれかを熱源とし、かつ配管に断熱被覆があるもの",null,null,null,null,null,null,null,"on：2　／　off：5，24，28，1，3"]
[null,null,null,null,null,null,"　①～③のいずれかを選択"]
[null,null,null,null,null,null,null,"① 石油潜熱回収型温水暖房機 【エコフィール】 の熱効率87.8% 以上のもの",null,null,null,null,null,null,"on：2　／　on：4　／　off：8，9，5，24，28，1，3"]
{"$rows_left_out":80}
{"sheet":"登録値_断熱材λ値","index":13,"n_rows":2,"n_cols":29,"rows_kept":2,"cut":false,"hidden":false,"merged":[]}
["住宅の省エネルギー基準と評価方法2024【戸建住宅版】　 6-029　6-030　6-031",null,null,null,null,null,null,null,null,null,null,null,null,null,null,null,null,null,null,null,null,null,null,null,null,null,null,null,"国交省資料ライブラリ：ー住宅の省エネルギー基準と評価方法2024【戸建住宅版】"]
[null,null,null,null,null,null,null,null,null,null,null,null,null,null,null,null,null,null,null,null,null,null,null,null,null,null,null,null,"https://www.mlit.go.jp/common/001627022.pdf"]

{"sheet":"登録値_窓、ドアのU値､ηd値","index":14,"n_rows":2,"n_cols":28,"rows_kept":2,"cut":false,"hidden":false,"merged":[]}
["住宅の省エネルギー基準と評価方法2024【戸建住宅版】　 6-032　6-033　6-035",null,null,null,null,null,null,null,null,null,null,null,null,null,null,null,null,null,null,null,null,null,null,null,null,null,null,"国交省資料ライブラリ：ー住宅の省エネルギー基準と評価方法2024【戸建住宅版】"]
[null,null,null,null,null,null,null,null,null,null,null,null,null,null,null,null,null,null,null,null,null,null,null,null,null,null,null,"https://www.mlit.go.jp/common/001627022.pdf"]

{"sheet":"改定後_地域区分_非表示","index":15,"n_rows":1713,"n_cols":14,"rows_kept":1713,"cut":false,"hidden":true,"merged":[[1,1,2,1],[1,2,2,2],[1,3,2,3],[1,11,2,11]]}
[null,"建築物エネルギー消費性能基準等を定める省令における算出方法等を定める件（国土交通省告示第二百六十五号）（抄）別表第10",null,null,null,null,null,null,null,null,null,null,null,"2021/3/5作成"]
[null,"都道府県名","市町村","計算","改定後",null,null,null,null,null,null,"都道府県名"]
[null,null,null,null,"地域の区分"]
[1,"北海道","愛別町",{"$f":"B4&C4","v":"北海道愛別町"},1,"アイベツチョウ",null,null,null,null,null,"北海道",1]
[1,"北海道","赤井川村","北海道赤井川村",2,"アカイガワムラ",null,null,null,null,null,"青森県",2]
[1,"北海道","赤平市","北海道赤平市",2,"アカビラシ",null,null,null,null,null,"岩手県",3]
{"$rows_left_out":1707}